Target
Adenosine receptor A2a
Ligand
BDBM50199301
Substrate
Meas. Tech.
ChEMBL_412203 (CHEMBL910042)
Ki
>10000±n/a nM
Citation
 Vu, CBKiesman, WFConlon, PRLin, KCTam, MPetter, RCSmits, GLutterodt, FJin, XChen, LZhang, J Tricyclic imidazoline derivatives as potent and selective adenosine A1 receptor antagonists. J Med Chem 49:7132-9 (2006)  
Target
Name:
Adenosine receptor A2a
Synonyms:
A2A adenosine receptor (hA2A) ADENOSINE A2 ADORA2 Adenosine A2A receptor (A2AAR)
Type:
G Protein-Coupled Receptor (GPCR)
Mol. Mass.:
44716.46
Organism:
Homo sapiens (Human)
Description:
P29274
Residue:
412
  
Inhibitor
Name:
BDBM50199301
Synonyms:
(R)-3-(4-(8-ethyl-5-oxo-4-propyl-4,5,7,8-tetrahydro-1H-imidazo[1,2-g]purin-2-yl)bicyclo[2.2.2]octan-1-yl)propanoic acid | CHEMBL217268
Type:
Small organic molecule
Emp. Form.:
C23H33N5O3
Mol. Mass.:
427.5398
SMILES:
CCCn1c2nc(nc2c2N[C@H](CC)Cn2c1=O)C12CCC(CCC(O)=O)(CC1)CC2
: