Target
Phenylethanolamine N-methyltransferase
Ligand
BDBM50072977
Substrate
Meas. Tech.
ChEMBL_441055 (CHEMBL890212)
Ki
56±n/a nM
Citation
 Grunewald, GLSeim, MRRegier, RCCriscione, KR Exploring the active site of phenylethanolamine N-methyltransferase with 1,2,3,4-tetrahydrobenz[h]isoquinoline inhibitors. Bioorg Med Chem 15:1298-310 (2007)  
Target
Name:
Phenylethanolamine N-methyltransferase
Synonyms:
Noradrenaline N-methyltransferase PNMT PNMTase | Phenylethanolamine N-Methyltransferase (PNMT)
Type:
Enzyme
Mol. Mass.:
30852.66
Organism:
Homo sapiens (Human)
Description:
Residue:
282
  
Inhibitor
Name:
BDBM50072977
Synonyms:
7-Bromo-1,2,3,4-tetrahydro-isoquinoline CHEMBL281864
Type:
Small organic molecule
Emp. Form.:
C9H10BrN
Mol. Mass.:
212.086
SMILES:
Brc1ccc2CCNCc2c1
: