Target
Sodium-dependent serotonin transporter
Ligand
BDBM50199595
Substrate
Meas. Tech.
ChEMBL_453433 (CHEMBL885432)
Ki
46±n/a nM
Citation
 Letavic, MAKeith, JMJablonowski, JAStocking, EMGomez, LALy, KSMiller, JMBarbier, AJBonaventure, PBoggs, JDWilson, SJMiller, KLLord, BMcAllister, HMTognarelli, DJWu, JAbad, MCSchubert, CLovenberg, TWCarruthers, NI Novel tetrahydroisoquinolines are histamine H3 antagonists and serotonin reuptake inhibitors. Bioorg Med Chem Lett 17:1047-51 (2007)  
Target
Name:
Sodium-dependent serotonin transporter
Synonyms:
5-HT Transporter 5HTT SC6A4_HUMAN SLC6A4 Serotonin transporter (5HTT) Sodium-dependent serotonin transporter (SERT) | Solute carrier family 6 member 4
Type:
Multi-pass membrane protein
Mol. Mass.:
70322.51
Organism:
Homo sapiens (Human)
Description:
P31645
Residue:
630
  
Inhibitor
Name:
BDBM50199595
Synonyms:
7-(3-(4-fluoropiperidin-1-yl)propoxy)-2-methyl-4-phenyl-1,2,3,4-tetrahydroisoquinoline | CHEMBL397065
Type:
Small organic molecule
Emp. Form.:
C24H31FN2O
Mol. Mass.:
382.5141
SMILES:
CN1CC(c2ccccc2)c2ccc(OCCCN3CCC(F)CC3)cc2C1
: