Target
Sodium-dependent serotonin transporter
Ligand
BDBM50199593
Substrate
Meas. Tech.
ChEMBL_453433 (CHEMBL885432)
Ki
2±n/a nM
Citation
 Letavic, MAKeith, JMJablonowski, JAStocking, EMGomez, LALy, KSMiller, JMBarbier, AJBonaventure, PBoggs, JDWilson, SJMiller, KLLord, BMcAllister, HMTognarelli, DJWu, JAbad, MCSchubert, CLovenberg, TWCarruthers, NI Novel tetrahydroisoquinolines are histamine H3 antagonists and serotonin reuptake inhibitors. Bioorg Med Chem Lett 17:1047-51 (2007)  
Target
Name:
Sodium-dependent serotonin transporter
Synonyms:
5-HT Transporter 5HTT SC6A4_HUMAN SLC6A4 Serotonin transporter (5HTT) Sodium-dependent serotonin transporter (SERT) | Solute carrier family 6 member 4
Type:
Multi-pass membrane protein
Mol. Mass.:
70322.51
Organism:
Homo sapiens (Human)
Description:
P31645
Residue:
630
  
Inhibitor
Name:
BDBM50199593
Synonyms:
7-(3-(4-fluoropiperidin-1-yl)propoxy)-2-methyl-4-(4-(methylthio)phenyl)-1,2,3,4-tetrahydroisoquinoline | CHEMBL395368
Type:
Small organic molecule
Emp. Form.:
C25H33FN2OS
Mol. Mass.:
428.606
SMILES:
CSc1ccc(cc1)C1CN(C)Cc2cc(OCCCN3CCC(F)CC3)ccc12
: