Target
Sodium-dependent serotonin transporter
Ligand
BDBM50199598
Substrate
Meas. Tech.
ChEMBL_453432 (CHEMBL885431)
Ki
3±n/a nM
Citation
 Letavic, MAKeith, JMJablonowski, JAStocking, EMGomez, LALy, KSMiller, JMBarbier, AJBonaventure, PBoggs, JDWilson, SJMiller, KLLord, BMcAllister, HMTognarelli, DJWu, JAbad, MCSchubert, CLovenberg, TWCarruthers, NI Novel tetrahydroisoquinolines are histamine H3 antagonists and serotonin reuptake inhibitors. Bioorg Med Chem Lett 17:1047-51 (2007)  
Target
Name:
Sodium-dependent serotonin transporter
Synonyms:
5-HT Transporter 5HT transporter Anandamid membrane transporter, AMT Monoamine transporters; Norepinephrine & serotonin Slc6a4 Sodium-dependent serotonin transporter (SERT) | imipramine receptor
Type:
Multi-pass membrane protein
Mol. Mass.:
70168.43
Organism:
Rattus norvegicus (rat)
Description:
P31652
Residue:
630
  
Inhibitor
Name:
BDBM50199598
Synonyms:
4-(4-(difluoromethoxy)phenyl)-7-(3-(4-fluoropiperidin-1-yl)propoxy)-2-methyl-1,2,3,4-tetrahydroisoquinoline | CHEMBL246954
Type:
Small organic molecule
Emp. Form.:
C25H31F3N2O2
Mol. Mass.:
448.521
SMILES:
CN1CC(c2ccc(OC(F)F)cc2)c2ccc(OCCCN3CCC(F)CC3)cc2C1
: