Target
Histamine H3 receptor
Ligand
BDBM50199607
Substrate
Meas. Tech.
ChEMBL_453434 (CHEMBL885433)
Ki
6.9±n/a nM
Citation
 Letavic, MAKeith, JMJablonowski, JAStocking, EMGomez, LALy, KSMiller, JMBarbier, AJBonaventure, PBoggs, JDWilson, SJMiller, KLLord, BMcAllister, HMTognarelli, DJWu, JAbad, MCSchubert, CLovenberg, TWCarruthers, NI Novel tetrahydroisoquinolines are histamine H3 antagonists and serotonin reuptake inhibitors. Bioorg Med Chem Lett 17:1047-51 (2007)  
Target
Name:
Histamine H3 receptor
Synonyms:
G-protein coupled receptor 97 HH3R HRH3 Histamine H3 receptor (H3) Histamine receptor (H3 and H4)
Type:
G Protein-Coupled Receptor (GPCR)
Mol. Mass.:
48691.47
Organism:
Homo sapiens (Human)
Description:
Binding assays were using CHO cells stably expressing hH3R receptors.
Residue:
445
  
Inhibitor
Name:
BDBM50199607
Synonyms:
(R)-4-(4-methoxyphenyl)-2-methyl-7-(3-((S)-3-methylmorpholino)propoxy)-1,2,3,4-tetrahydroisoquinoline | CHEMBL247161
Type:
Small organic molecule
Emp. Form.:
C25H34N2O3
Mol. Mass.:
410.5491
SMILES:
COc1ccc(cc1)[C@H]1CN(C)Cc2cc(OCCCN3CCOC[C@@H]3C)ccc12
: