Target
Sodium-dependent serotonin transporter
Ligand
BDBM50199597
Substrate
Meas. Tech.
ChEMBL_453432 (CHEMBL885431)
Ki
2.3±n/a nM
Citation
 Letavic, MAKeith, JMJablonowski, JAStocking, EMGomez, LALy, KSMiller, JMBarbier, AJBonaventure, PBoggs, JDWilson, SJMiller, KLLord, BMcAllister, HMTognarelli, DJWu, JAbad, MCSchubert, CLovenberg, TWCarruthers, NI Novel tetrahydroisoquinolines are histamine H3 antagonists and serotonin reuptake inhibitors. Bioorg Med Chem Lett 17:1047-51 (2007)  
Target
Name:
Sodium-dependent serotonin transporter
Synonyms:
5-HT Transporter 5HT transporter Anandamid membrane transporter, AMT Monoamine transporters; Norepinephrine & serotonin Slc6a4 Sodium-dependent serotonin transporter (SERT) | imipramine receptor
Type:
Multi-pass membrane protein
Mol. Mass.:
70168.43
Organism:
Rattus norvegicus (rat)
Description:
P31652
Residue:
630
  
Inhibitor
Name:
BDBM50199597
Synonyms:
2-methyl-4-(4-(methylthio)phenyl)-7-(3-morpholinopropoxy)-1,2,3,4-tetrahydroisoquinoline | CHEMBL246955
Type:
Small organic molecule
Emp. Form.:
C24H32N2O2S
Mol. Mass.:
412.588
SMILES:
CSc1ccc(cc1)C1CN(C)Cc2cc(OCCCN3CCOCC3)ccc12
: