Target
Sodium-dependent dopamine transporter
Ligand
BDBM50056569
Substrate
Meas. Tech.
ChEMBL_458901 (CHEMBL923872)
Ki
0.7±n/a nM
Citation
 Gilbert, KMBoos, TLDersch, CMGreiner, EJacobson, AELewis, DMatecka, DPrisinzano, TEZhang, YRothman, RBRice, KCVenanzi, CA DAT/SERT selectivity of flexible GBR 12909 analogs modeled using 3D-QSAR methods. Bioorg Med Chem 15:1146-59 (2006)  
Target
Name:
Sodium-dependent dopamine transporter
Synonyms:
DA transporter SC6A3_RAT Sodium-dependent dopamine transporter | Sodium-dependent dopamine transporter (DAT)
Type:
Multi-pass membrane protein
Mol. Mass.:
68749.45
Organism:
Rattus norvegicus (rat)
Description:
P23977
Residue:
619
  
Inhibitor
Name:
BDBM50056569
Synonyms:
2-((4-(2-(bis(4-fluorophenyl)methoxy)ethyl)piperazin-1-yl)methyl)-1H-indole CHEMBL160073
Type:
Small organic molecule
Emp. Form.:
C28H29F2N3O
Mol. Mass.:
461.5462
SMILES:
Fc1ccc(cc1)C(OCCN1CCN(Cc2cc3ccccc3[nH]2)CC1)c1ccc(F)cc1
: