Target
Peroxisome proliferator-activated receptor gamma
Ligand
BDBM50199776
Substrate
Meas. Tech.
ChEMBL_453568 (CHEMBL885568)
IC50
35±n/a nM
Citation
 Gonzalez, ICLamar, JIradier, FXu, YWinneroski, LLYork, JYumibe, NZink, RMontrose-Rafizadeh, CEtgen, GJBroderick, CLOldham, BAMantlo, N Design and synthesis of a novel class of dual PPARgamma/delta agonists. Bioorg Med Chem Lett 17:1052-5 (2007)  
Target
Name:
Peroxisome proliferator-activated receptor gamma
Synonyms:
NR1C3 PPAR-gamma PPARG_HUMAN Peroxisome proliferator-activated receptor gamma (PPAR gamma) Peroxisome proliferator-activated receptor gamma (PPARĪ³) peroxisome proliferator-activated receptor gamma isoform 2
Type:
Nuclear Receptor
Mol. Mass.:
57613.46
Organism:
Homo sapiens (Human)
Description:
P37231
Residue:
505
  
Inhibitor
Name:
BDBM50199776
Synonyms:
3-(2-ethyl-4-((R)-3-(4-ethyl-2-(pyridin-2-yl)phenoxy)butoxy)phenyl)propanoic acid | CHEMBL241479
Type:
Small organic molecule
Emp. Form.:
C28H33NO4
Mol. Mass.:
447.5659
SMILES:
CCc1ccc(O[C@H](C)CCOc2ccc(CCC(O)=O)c(CC)c2)c(c1)-c1ccccn1
: