Target
Prostaglandin D2 receptor 2
Ligand
BDBM50200247
Substrate
Meas. Tech.
ChEMBL_408429 (CHEMBL908864)
IC50
3.6±n/a nM
Citation
 Ulven, TReceveur, JMGrimstrup, MRist, ØFrimurer, TMGerlach, LOMathiesen, JMKostenis, EUller, LHögberg, T Novel selective orally active CRTH2 antagonists for allergic inflammation developed from in silico derived hits. J Med Chem 49:6638-41 (2006)  
Target
Name:
Prostaglandin D2 receptor 2
Synonyms:
CD_antigen=CD294 Chemoattractant Receptor-homologous molecule expressed on T-helper type 2 cells (CRTH2) Chemoattractant receptor-homologous molecule expressed on Th2 cells (CRTH2) G protein-coupled receptor 44 GPR44 PTGDR2 Prostaglandin D2 receptor 2 | Prostaglandin D2 receptor 2 (PGD2)
Type:
Enzyme
Mol. Mass.:
43295.45
Organism:
Homo sapiens (Human)
Description:
Q9Y5Y4
Residue:
395
  
Inhibitor
Name:
BDBM50200247
Synonyms:
4-bromo-2-[1-(4-methoxyphenyl)-1H-pyrazole-4-carbonyl]phenoxyacetic acid | CHEMBL216367
Type:
Small organic molecule
Emp. Form.:
C19H15BrN2O5
Mol. Mass.:
431.237
SMILES:
COc1ccc(cc1)-n1cc(cn1)C(=O)c1cc(Br)ccc1OCC(O)=O
: