Target
Steryl-sulfatase
Ligand
BDBM50200941
Substrate
Meas. Tech.
ChEMBL_423907 (CHEMBL910729)
IC50
1000±n/a nM
Citation
 Leese, MPLeblond, BSmith, ANewman, SPDi Fiore, ADe Simone, GSupuran, CTPurohit, AReed, MJPotter, BV 2-substituted estradiol bis-sulfamates, multitargeted antitumor agents: synthesis, in vitro SAR, protein crystallography, and in vivo activity. J Med Chem 49:7683-96 (2006)  
Target
Name:
Steryl-sulfatase
Synonyms:
ARSC1 Arylsulfatase C STS_HUMAN Steryl-sulfate sulfohydrolase
Type:
Enzyme
Mol. Mass.:
65503.66
Organism:
Homo sapiens (Human)
Description:
P08842
Residue:
583
  
Inhibitor
Name:
BDBM50200941
Synonyms:
(9BETA,13ALPHA,14BETA,17ALPHA)-2-ETHYLESTRA-1(10),2,4-TRIENE-3,17-DIYL DISULFAMATE 2-ethylestradiol-3,17-O,O-bis-sulfamate | CHEMBL425287
Type:
Small organic molecule
Emp. Form.:
C20H30N2O6S2
Mol. Mass.:
458.592
SMILES:
CCc1cc2[C@H]3CC[C@]4(C)[C@H](CC[C@H]4[C@@H]3CCc2cc1OS(N)(=O)=O)OS(N)(=O)=O
: