Target
Acetylcholinesterase
Ligand
BDBM50201171
Substrate
Meas. Tech.
ChEMBL_441415 (CHEMBL891644)
IC50
4600±n/a nM
Citation
 Choo, CYHirasawa, YKarimata, CKoyama, KSekiguchi, MKobayashi, JMorita, H Carinatumins A-C, new alkaloids from Lycopodium carinatum inhibiting acetylcholinesterase. Bioorg Med Chem 15:1703-7 (2007)  
Target
Name:
Acetylcholinesterase
Synonyms:
ACES_BOVIN Acetylcholinesterase (AChE) | Acetylcholinesterase precursor
Type:
Enzyme
Mol. Mass.:
67659.62
Organism:
Bos taurus (bovine)
Description:
Residue:
613
  
Inhibitor
Name:
BDBM50201171
Synonyms:
(1S,9R)-1-amino-13-[2-hydroxy-eth-(E)-ylidene]-11-methyl-6-aza-tricyclo[7.3.1.0*2,7*]trideca-2(7),3,10-trien-5-one | CHEMBL394586
Type:
Small organic molecule
Emp. Form.:
C15H18N2O2
Mol. Mass.:
258.3156
SMILES:
CC1=C[C@H]2Cc3[nH]c(=O)ccc3[C@](N)(C1)\C2=C\CO
: