Target
D(1A) dopamine receptor
Ligand
BDBM50201335
Substrate
Meas. Tech.
ChEMBL_453884 (CHEMBL885886)
Ki
0.82±n/a nM
Citation
 Enzensperger, CKilian, SAckermann, MKoch, AKelch, KLehmann, J Dopamine/serotonin receptor ligands. Part 15: Oxygenation of the benz-indolo-azecine LE 300 leads to novel subnanomolar dopamine D1/D5 antagonists. Bioorg Med Chem Lett 17:1399-402 (2007)  
Target
Name:
D(1A) dopamine receptor
Synonyms:
DA D1 receptor DRD1 Dopamine D1 receptor Dopamine D1A
Type:
Enzyme
Mol. Mass.:
49303.43
Organism:
Homo sapiens (Human)
Description:
P21728
Residue:
446
  
Inhibitor
Name:
BDBM50201335
Synonyms:
11-methoxy-7-methyl-6,7,8,9,14,15-hexahydro-5H-indolo[3,2-f][3]benzazecine | CHEMBL396560
Type:
Small organic molecule
Emp. Form.:
C21H24N2O
Mol. Mass.:
320.4281
SMILES:
COc1ccc2[nH]c3Cc4ccccc4CCN(C)CCc3c2c1
: