Target
Proteinase-activated receptor 1
Ligand
BDBM50202073
Substrate
Meas. Tech.
ChEMBL_423382 (CHEMBL909901)
Ki
11±n/a nM
Citation
 Clasby, MCChackalamannil, SCzarniecki, MDoller, DEagen, KGreenlee, WKao, GLin, YTsai, HXia, YAhn, HSAgans-Fantuzzi, JBoykow, GChintala, MFoster, CSmith-Torhan, AAlton, KBryant, MHsieh, YLau, JPalamanda, J Metabolism-based identification of a potent thrombin receptor antagonist. J Med Chem 50:129-38 (2007)  
Target
Name:
Proteinase-activated receptor 1
Synonyms:
CF2R F2R PAR1 Proteinase activated receptor 1 TR Thrombin receptor/ Proteinase-activated receptor 1(Par-1)
Type:
Protein
Mol. Mass.:
47450.07
Organism:
Homo sapiens (Human)
Description:
P25116
Residue:
425
  
Inhibitor
Name:
BDBM50202073
Synonyms:
(3R,3aS,4S,4aR,7R,8aR,9aR)-decahydro-7-hydroxy-3-methyl-4-[(E)-2-[5-[3-(trifluoromethyl)phenyl]-2-pyridinyl]ethenyl]naphtho[2,3-c]furan-1(3H)-one | CHEMBL218933
Type:
Small organic molecule
Emp. Form.:
C27H28F3NO3
Mol. Mass.:
471.5113
SMILES:
C[C@H]1OC(=O)[C@@H]2C[C@@H]3C[C@H](O)CC[C@H]3[C@H](\C=C\c3ccc(cn3)-c3cccc(c3)C(F)(F)F)[C@H]12
: