Target
B1 bradykinin receptor
Ligand
BDBM50202416
Substrate
Meas. Tech.
ChEMBL_423668 (CHEMBL913433)
Ki
0.6±n/a nM
Citation
 Kuduk, SDDi Marco, CNChang, RKWood, MRSchirripa, KMKim, JJWai, JMDiPardo, RMMurphy, KLRansom, RWHarrell, CMReiss, DRHolahan, MACook, JHess, JFSain, NUrban, MOTang, CPrueksaritanont, TPettibone, DJBock, MG Development of orally bioavailable and CNS penetrant biphenylaminocyclopropane carboxamide bradykinin B1 receptor antagonists. J Med Chem 50:272-82 (2007)  
Target
Name:
B1 bradykinin receptor
Synonyms:
B1 BRADYKININ B1R BK-1 receptor BRADYB1 | Bradykinin B1 receptor
Type:
Enzyme
Mol. Mass.:
40508.87
Organism:
Homo sapiens (Human)
Description:
P46663
Residue:
353
  
Inhibitor
Name:
BDBM50202416
Synonyms:
CHEMBL220657 | N-{(1R)-1-[3,3'-difluoro-2'-(2-methyl-2H-tetraazol-5-yl)-1,1'-biphenyl-4-yl]ethyl}-1-[(trifluoroacetyl)amino]cyclopropanecarboxamide
Type:
Small organic molecule
Emp. Form.:
C22H19F5N6O2
Mol. Mass.:
494.4173
SMILES:
C[C@@H](NC(=O)C1(CC1)NC(=O)C(F)(F)F)c1ccc(cc1F)-c1cccc(F)c1-c1nnn(C)n1
: