Target
Glutamate receptor ionotropic, NMDA 2B
Ligand
BDBM50203311
Substrate
Meas. Tech.
ChEMBL_425253 (CHEMBL856830)
Ki
3.4±n/a nM
Citation
 Liverton, NJBednar, RABednar, BButcher, JWClaiborne, CFClaremon, DACunningham, MDiLella, AGGaul, SLLibby, BELyle, EALynch, JJMcCauley, JAMosser, SDNguyen, KTStump, GLSun, HWang, HYergey, JKoblan, KS Identification and characterization of 4-methylbenzyl 4-[(pyrimidin-2-ylamino)methyl]piperidine-1-carboxylate, an orally bioavailable, brain penetrant NR2B selective N-methyl-D-aspartate receptor antagonist. J Med Chem 50:807-19 (2007)  
Target
Name:
Glutamate receptor ionotropic, NMDA 2B
Synonyms:
GRIN2B Glutamate [NMDA] receptor subunit epsilon 2 N-methyl D-aspartate receptor subtype 2B NMDAR2B NR3 | hNR3
Type:
PROTEIN
Mol. Mass.:
166375.46
Organism:
Homo sapiens (Human)
Description:
ChEMBL_1438829
Residue:
1484
  
Inhibitor
Name:
BDBM50203311
Synonyms:
4-methylbenzyl 4-[(2-pyrimidinylamino)methyl]-1-piperidinecarboxylate | CHEMBL218713
Type:
Small organic molecule
Emp. Form.:
C19H24N4O2
Mol. Mass.:
340.4195
SMILES:
Cc1ccc(COC(=O)N2CCC(CNc3ncccn3)CC2)cc1
: