Target
Stromelysin-1
Ligand
BDBM50203527
Substrate
Meas. Tech.
ChEMBL_425540 (CHEMBL911377)
IC50
4000±n/a nM
Citation
 Yao, WZhuo, JBurns, DMXu, MZhang, CLi, YLQian, DQHe, CWeng, LShi, ELin, QAgrios, CBurn, TCCaulder, ECovington, MBFridman, JSFriedman, SKatiyar, KHollis, GLi, YLiu, CLiu, XMarando, CANewton, RPan, MScherle, PTaylor, NVaddi, KWasserman, ZRWynn, RYeleswaram, SJalluri, RBower, MZhou, BBMetcalf, B Discovery of a potent, selective, and orally active human epidermal growth factor receptor-2 sheddase inhibitor for the treatment of cancer. J Med Chem 50:603-6 (2007)  
Target
Name:
Stromelysin-1
Synonyms:
MMP-3 MMP3_HUMAN Matrix metalloproteinase 3 Matrix metalloproteinase-3 (MMP-3) SL-1 Stromelysin 1 | Transin-1
Type:
Enzyme
Mol. Mass.:
53973.13
Organism:
Homo sapiens (Human)
Description:
P08254
Residue:
477
  
Inhibitor
Name:
BDBM50203527
Synonyms:
(6S,7S)-methyl 7-(hydroxycarbamoyl)-6-(4-phenyl-1,2,3,6-tetrahydropyridine-1-carbonyl)-5-azaspiro[2.5]octane-5-carboxylate methyl (6S,7S)-7-[(hydroxyamino)carbonyl]-6-[(4-phenyl-3,6-dihydropyridin-1(2H)-yl)carbonyl]-5-azaspiro[2.5]octane-5-carboxylate
Type:
Small organic molecule
Emp. Form.:
C22H27N3O5
Mol. Mass.:
413.4669
SMILES:
COC(=O)N1CC2(CC2)C[C@@H]([C@H]1C(=O)N1CCC(=CC1)c1ccccc1)C(=O)NO
: