Target
72 kDa type IV collagenase
Ligand
BDBM50203532
Substrate
Meas. Tech.
ChEMBL_425539 (CHEMBL911376)
IC50
>1000±n/a nM
Citation
 Yao, WZhuo, JBurns, DMXu, MZhang, CLi, YLQian, DQHe, CWeng, LShi, ELin, QAgrios, CBurn, TCCaulder, ECovington, MBFridman, JSFriedman, SKatiyar, KHollis, GLi, YLiu, CLiu, XMarando, CANewton, RPan, MScherle, PTaylor, NVaddi, KWasserman, ZRWynn, RYeleswaram, SJalluri, RBower, MZhou, BBMetcalf, B Discovery of a potent, selective, and orally active human epidermal growth factor receptor-2 sheddase inhibitor for the treatment of cancer. J Med Chem 50:603-6 (2007)  
Target
Name:
72 kDa type IV collagenase
Synonyms:
72 kDa gelatinase CLG4A Gelatinase A (MMP-2) MMP2_HUMAN Matrix metalloproteinase-2 (MMP 2) Matrix metalloproteinases 2 (MMP-2) | TBE-1
Type:
Enzyme
Mol. Mass.:
73870.36
Organism:
Homo sapiens (Human)
Description:
P08253
Residue:
660
  
Inhibitor
Name:
BDBM50203532
Synonyms:
(6S,7S)-5-methyl-5-aza-spiro[2.5]octane-6,7-dicarboxylic acid 6-sec-butylamide 7-hydroxyamide | CHEMBL220975
Type:
Small organic molecule
Emp. Form.:
C14H25N3O3
Mol. Mass.:
283.3666
SMILES:
CCC(C)NC(=O)[C@@H]1[C@H](CC2(CC2)CN1C)C(=O)NO
: