Target
72 kDa type IV collagenase
Ligand
BDBM50203534
Substrate
Meas. Tech.
ChEMBL_425539 (CHEMBL911376)
IC50
150±n/a nM
Citation
 Yao, WZhuo, JBurns, DMXu, MZhang, CLi, YLQian, DQHe, CWeng, LShi, ELin, QAgrios, CBurn, TCCaulder, ECovington, MBFridman, JSFriedman, SKatiyar, KHollis, GLi, YLiu, CLiu, XMarando, CANewton, RPan, MScherle, PTaylor, NVaddi, KWasserman, ZRWynn, RYeleswaram, SJalluri, RBower, MZhou, BBMetcalf, B Discovery of a potent, selective, and orally active human epidermal growth factor receptor-2 sheddase inhibitor for the treatment of cancer. J Med Chem 50:603-6 (2007)  
Target
Name:
72 kDa type IV collagenase
Synonyms:
72 kDa gelatinase CLG4A Gelatinase A (MMP-2) MMP2_HUMAN Matrix metalloproteinase-2 (MMP 2) Matrix metalloproteinases 2 (MMP-2) | TBE-1
Type:
Enzyme
Mol. Mass.:
73870.36
Organism:
Homo sapiens (Human)
Description:
P08253
Residue:
660
  
Inhibitor
Name:
BDBM50203534
Synonyms:
(6S,7S)-N-hydroxy-5-methyl-6-(4-phenylpiperazine-1-carbonyl)-5-azaspiro[2.5]octane-7-carboxamide CHEMBL387202
Type:
Small organic molecule
Emp. Form.:
C20H28N4O3
Mol. Mass.:
372.4613
SMILES:
CN1CC2(CC2)C[C@@H]([C@H]1C(=O)N1CCN(CC1)c1ccccc1)C(=O)NO
: