Target
Stromelysin-1
Ligand
BDBM50203533
Substrate
Meas. Tech.
ChEMBL_425540 (CHEMBL911377)
IC50
>3000±n/a nM
Citation
 Yao, WZhuo, JBurns, DMXu, MZhang, CLi, YLQian, DQHe, CWeng, LShi, ELin, QAgrios, CBurn, TCCaulder, ECovington, MBFridman, JSFriedman, SKatiyar, KHollis, GLi, YLiu, CLiu, XMarando, CANewton, RPan, MScherle, PTaylor, NVaddi, KWasserman, ZRWynn, RYeleswaram, SJalluri, RBower, MZhou, BBMetcalf, B Discovery of a potent, selective, and orally active human epidermal growth factor receptor-2 sheddase inhibitor for the treatment of cancer. J Med Chem 50:603-6 (2007)  
Target
Name:
Stromelysin-1
Synonyms:
MMP-3 MMP3_HUMAN Matrix metalloproteinase 3 Matrix metalloproteinase-3 (MMP-3) SL-1 Stromelysin 1 | Transin-1
Type:
Enzyme
Mol. Mass.:
53973.13
Organism:
Homo sapiens (Human)
Description:
P08254
Residue:
477
  
Inhibitor
Name:
BDBM50203533
Synonyms:
(6S,7S)-N-hydroxy-6-((R)-3-phenylpyrrolidine-1-carbonyl)-5-azaspiro[2.5]octane-7-carboxamide CHEMBL221698
Type:
Small organic molecule
Emp. Form.:
C19H25N3O3
Mol. Mass.:
343.4201
SMILES:
ONC(=O)[C@H]1CC2(CC2)CN[C@@H]1C(=O)N1CC[C@@H](C1)c1ccccc1
: