Target
Receptor tyrosine-protein kinase erbB-2
Ligand
BDBM50203531
Substrate
Meas. Tech.
ChEMBL_425536 (CHEMBL911373)
IC50
300±n/a nM
Citation
 Yao, WZhuo, JBurns, DMXu, MZhang, CLi, YLQian, DQHe, CWeng, LShi, ELin, QAgrios, CBurn, TCCaulder, ECovington, MBFridman, JSFriedman, SKatiyar, KHollis, GLi, YLiu, CLiu, XMarando, CANewton, RPan, MScherle, PTaylor, NVaddi, KWasserman, ZRWynn, RYeleswaram, SJalluri, RBower, MZhou, BBMetcalf, B Discovery of a potent, selective, and orally active human epidermal growth factor receptor-2 sheddase inhibitor for the treatment of cancer. J Med Chem 50:603-6 (2007)  
Target
Name:
Receptor tyrosine-protein kinase erbB-2
Synonyms:
2.7.10.1 CD_antigen=CD340 ERBB2_HUMAN FASN/HER2 HER2 MLN19 NEU Proto-oncogene Neu Tyrosine kinase-type cell surface receptor HER2 | p185erbB2
Type:
Mol. Mass.:
137894.47
Organism:
Homo sapiens (Human)
Description:
P04626
Residue:
1255
  
Inhibitor
Name:
BDBM50203531
Synonyms:
(6S,7S)-N-hydroxy-6-{[4-(2-methyl-4-nitrophenyl)-3,6-dihydropyridin-1(2H)-yl]carbonyl}-5-azaspiro[2.5]octane-7-carboxamide | CHEMBL373853
Type:
Small organic molecule
Emp. Form.:
C21H26N4O5
Mol. Mass.:
414.4549
SMILES:
Cc1cc(ccc1C1=CCN(CC1)C(=O)[C@H]1NCC2(CC2)C[C@@H]1C(=O)NO)[N+]([O-])=O
: