Target
Disintegrin and metalloproteinase domain-containing protein 10
Ligand
BDBM50203531
Substrate
Meas. Tech.
ChEMBL_425537 (CHEMBL911374)
IC50
130±n/a nM
Citation
 Yao, WZhuo, JBurns, DMXu, MZhang, CLi, YLQian, DQHe, CWeng, LShi, ELin, QAgrios, CBurn, TCCaulder, ECovington, MBFridman, JSFriedman, SKatiyar, KHollis, GLi, YLiu, CLiu, XMarando, CANewton, RPan, MScherle, PTaylor, NVaddi, KWasserman, ZRWynn, RYeleswaram, SJalluri, RBower, MZhou, BBMetcalf, B Discovery of a potent, selective, and orally active human epidermal growth factor receptor-2 sheddase inhibitor for the treatment of cancer. J Med Chem 50:603-6 (2007)  
Target
Name:
Disintegrin and metalloproteinase domain-containing protein 10
Synonyms:
ADA10_HUMAN Disintegrin and metalloproteinase domain-containing protein 10 (ADAM10) MADM
Type:
Enzyme
Mol. Mass.:
84160.93
Organism:
Homo sapiens (Human)
Description:
O14672
Residue:
748
  
Inhibitor
Name:
BDBM50203531
Synonyms:
(6S,7S)-N-hydroxy-6-{[4-(2-methyl-4-nitrophenyl)-3,6-dihydropyridin-1(2H)-yl]carbonyl}-5-azaspiro[2.5]octane-7-carboxamide | CHEMBL373853
Type:
Small organic molecule
Emp. Form.:
C21H26N4O5
Mol. Mass.:
414.4549
SMILES:
Cc1cc(ccc1C1=CCN(CC1)C(=O)[C@H]1NCC2(CC2)C[C@@H]1C(=O)NO)[N+]([O-])=O
: