Target
Androgen receptor
Ligand
BDBM50205101
Substrate
Meas. Tech.
ChEMBL_438312 (CHEMBL887414)
EC50
>10000±n/a nM
Citation
 Hamann, LGManfredi, MCSun, CKrystek, SRHuang, YBi, YAugeri, DJWang, TZou, YBetebenner, DAFura, ASeethala, RGolla, RKuhns, JELupisella, JADarienzo, CJCuster, LLPrice, JLJohnson, JMBiller, SAZahler, ROstrowski, J Tandem optimization of target activity and elimination of mutagenic potential in a potent series of N-aryl bicyclic hydantoin-based selective androgen receptor modulators. Bioorg Med Chem Lett 17:1860-4 (2007)  
Target
Name:
Androgen receptor
Synonyms:
ANDR_HUMAN Androgen Receptor Androgen receptor/Baculoviral IAP repeat-containing protein 2 Dihydrotestosterone receptor Nuclear receptor subfamily 3 group C member 4
Type:
Receptor
Mol. Mass.:
99185.27
Organism:
Homo sapiens (Human)
Description:
CHO cells were stably transfected with human AR gene.
Residue:
920
  
Inhibitor
Name:
BDBM50205101
Synonyms:
4-((7R,7aS)-7-hydroxy-1,3-dioxo-tetrahydro-1H-pyrrolo[1,2-e]imidazol-2(3H)-yl)-2-(trifluoromethyl)benzonitrile | CHEMBL388421
Type:
Small organic molecule
Emp. Form.:
C14H10F3N3O3
Mol. Mass.:
325.2427
SMILES:
O[C@@H]1CCn2c1c(O)n(-c1ccc(C#N)c(c1)C(F)(F)F)c2=O
: