Target
Androgen receptor
Ligand
BDBM50205109
Substrate
Meas. Tech.
ChEMBL_438312 (CHEMBL887414)
EC50
345±n/a nM
Citation
 Hamann, LGManfredi, MCSun, CKrystek, SRHuang, YBi, YAugeri, DJWang, TZou, YBetebenner, DAFura, ASeethala, RGolla, RKuhns, JELupisella, JADarienzo, CJCuster, LLPrice, JLJohnson, JMBiller, SAZahler, ROstrowski, J Tandem optimization of target activity and elimination of mutagenic potential in a potent series of N-aryl bicyclic hydantoin-based selective androgen receptor modulators. Bioorg Med Chem Lett 17:1860-4 (2007)  
Target
Name:
Androgen receptor
Synonyms:
ANDR_HUMAN Androgen Receptor Androgen receptor/Baculoviral IAP repeat-containing protein 2 Dihydrotestosterone receptor Nuclear receptor subfamily 3 group C member 4
Type:
Receptor
Mol. Mass.:
99185.27
Organism:
Homo sapiens (Human)
Description:
CHO cells were stably transfected with human AR gene.
Residue:
920
  
Inhibitor
Name:
BDBM50205109
Synonyms:
5-((7R,7aS)-7-hydroxy-1,3-dioxo-tetrahydro-pyrrolo[1,2-c]imidazol-2-yl)-biphenyl-2-carbonitrile | CHEMBL230053
Type:
Small organic molecule
Emp. Form.:
C19H15N3O3
Mol. Mass.:
333.3407
SMILES:
O[C@@H]1CCn2c1c(O)n(-c1ccc(C#N)c(c1)-c1ccccc1)c2=O
: