Target
Acetyl-CoA carboxylase 2
Ligand
BDBM50205246
Substrate
Meas. Tech.
ChEMBL_428251 (CHEMBL916200)
IC50
3±n/a nM
Citation
 Gu, YGWeitzberg, MClark, RFXu, XLi, QLubbers, NLYang, YBeno, DWWidomski, DLZhang, THansen, TMKeyes, RFWaring, JFCarroll, SLWang, XWang, RHealan-Greenberg, CHBlomme, EABeutel, BASham, HLCamp, HS N-{3-[2-(4-alkoxyphenoxy)thiazol-5-yl]-1-methylprop-2-ynyl}carboxy derivatives as acetyl-coA carboxylase inhibitors--improvement of cardiovascular and neurological liabilities via structural modifications. J Med Chem 50:1078-82 (2007)  
Target
Name:
Acetyl-CoA carboxylase 2
Synonyms:
ACACB ACC-beta ACCB Acetyl-CoA carboxylase 2 Acetyl-CoA carboxylase 2 (ACC2)
Type:
Protein
Mol. Mass.:
276535.21
Organism:
Homo sapiens (Human)
Description:
O00763
Residue:
2458
  
Inhibitor
Name:
BDBM50205246
Synonyms:
(S)-(-)-N-(1-(3-(2-(4-isopropoxyphenoxy)thiazol-5-yl)isoxazol-5-yl)ethyl)acetamide | CHEMBL221169
Type:
Small organic molecule
Emp. Form.:
C19H21N3O4S
Mol. Mass.:
387.453
SMILES:
CC(C)Oc1ccc(Oc2ncc(s2)-c2cc(on2)[C@H](C)NC(C)=O)cc1
: