Target
Adenosine receptor A1
Ligand
BDBM50205280
Substrate
Meas. Tech.
ChEMBL_425907 (CHEMBL907967)
Ki
0.55±n/a nM
Citation
 Chang, LCvon Frijtag Drabbe Künzel, JKMulder-Krieger, TWesterhout, JSpangenberg, TBrussee, JIjzerman, AP 2,6,8-trisubstituted 1-deazapurines as adenosine receptor antagonists. J Med Chem 50:828-34 (2007)  
Target
Name:
Adenosine receptor A1
Synonyms:
A1 adenosine receptor (hA1) AA1R_HUMAN ADORA1 Adenosine A1-receptor Adenosine receptor A1 (hA1) | Adenosine transporter (AdT)
Type:
G Protein-Coupled Receptor (GPCR)
Mol. Mass.:
36520.92
Organism:
Homo sapiens (Human)
Description:
P30542
Residue:
326
  
Inhibitor
Name:
BDBM50205280
Synonyms:
2,6-diphenyl-8-isobutyl-1-deazapurine LUF-5978
Type:
Small organic molecule
Emp. Form.:
C22H21N3
Mol. Mass.:
327.4222
SMILES:
CC(C)Cc1nc2c(cc(nc2[nH]1)-c1ccccc1)-c1ccccc1
: