Target
Cyclin-dependent kinase 1
Ligand
BDBM50205472
Substrate
Meas. Tech.
ChEMBL_442367 (CHEMBL892529)
Ki
35±n/a nM
Citation
 Chen, SChen, LLe, NTZhao, CSidduri, ALou, JPMichoud, CPortland, LJackson, NLiu, JJKonzelmann, FChi, FTovar, CXiang, QChen, YWen, YVassilev, LT Synthesis and activity of quinolinyl-methylene-thiazolinones as potent and selective cyclin-dependent kinase 1 inhibitors. Bioorg Med Chem Lett 17:2134-8 (2007)  
Target
Name:
Cyclin-dependent kinase 1
Synonyms:
CDC2 CDK1 CDKN1 Cell division protein kinase 1 P34CDC2 | p34 protein kinase
Type:
Enzyme Subunit
Mol. Mass.:
34101.08
Organism:
Homo sapiens (Human)
Description:
P06493
Residue:
297
  
Inhibitor
Name:
BDBM50205472
Synonyms:
(5Z)-5-(quinolin-6-ylmethylidene)-2-[(thiophen-2-ylmethyl)amino]-1,3-thiazol-4(5H)-one CHEMBL261644 | CHEMBL393929
Type:
Small organic molecule
Emp. Form.:
C18H13N3OS2
Mol. Mass.:
351.445
SMILES:
O=C1N=C(NCc2cccs2)SC1=Cc1ccc2ncccc2c1
: