Target
Mitogen-activated protein kinase 1
Ligand
BDBM50205477
Substrate
Meas. Tech.
ChEMBL_442374 (CHEMBL892536)
Ki
220±n/a nM
Citation
 Chen, SChen, LLe, NTZhao, CSidduri, ALou, JPMichoud, CPortland, LJackson, NLiu, JJKonzelmann, FChi, FTovar, CXiang, QChen, YWen, YVassilev, LT Synthesis and activity of quinolinyl-methylene-thiazolinones as potent and selective cyclin-dependent kinase 1 inhibitors. Bioorg Med Chem Lett 17:2134-8 (2007)  
Target
Name:
Mitogen-activated protein kinase 1
Synonyms:
ERK2 Extracellular signal-regulated kinase 2 Extracellular signal-regulated kinase 2 (ERK2) MAPK 2 MK01_HUMAN Mitogen-activated protein kinase 1 (ERK-2) Mitogen-activated protein kinase 2 PRKM2 | p42-MAPK
Type:
Ser/Thr Protein Kinase
Mol. Mass.:
41392.76
Organism:
Homo sapiens (Human)
Description:
P28482
Residue:
360
  
Inhibitor
Name:
BDBM50205477
Synonyms:
(Z)-2-((1R,2S)-2-phenylcyclopropylamino)-5-(quinolin-6-ylmethylene)thiazol-4(5H)-one | CHEMBL235345
Type:
Small organic molecule
Emp. Form.:
C22H17N3OS
Mol. Mass.:
371.455
SMILES:
O=C1N=C(N[C@@H]2C[C@H]2c2ccccc2)SC1=Cc1ccc2ncccc2c1
: