Target
Tyrosine-protein kinase Fyn
Ligand
BDBM50205472
Substrate
Meas. Tech.
ChEMBL_442376 (CHEMBL892538)
Ki
>2000±n/a nM
Citation
 Chen, SChen, LLe, NTZhao, CSidduri, ALou, JPMichoud, CPortland, LJackson, NLiu, JJKonzelmann, FChi, FTovar, CXiang, QChen, YWen, YVassilev, LT Synthesis and activity of quinolinyl-methylene-thiazolinones as potent and selective cyclin-dependent kinase 1 inhibitors. Bioorg Med Chem Lett 17:2134-8 (2007)  
Target
Name:
Tyrosine-protein kinase Fyn
Synonyms:
FYN Proto-oncogene Syn SLK Src-like kinase | p59-Fyn
Type:
Enzyme
Mol. Mass.:
60762.21
Organism:
Homo sapiens (Human)
Description:
P06241
Residue:
537
  
Inhibitor
Name:
BDBM50205472
Synonyms:
(5Z)-5-(quinolin-6-ylmethylidene)-2-[(thiophen-2-ylmethyl)amino]-1,3-thiazol-4(5H)-one CHEMBL261644 | CHEMBL393929
Type:
Small organic molecule
Emp. Form.:
C18H13N3OS2
Mol. Mass.:
351.445
SMILES:
O=C1N=C(NCc2cccs2)SC1=Cc1ccc2ncccc2c1
: