Target
Vascular endothelial growth factor receptor 2
Ligand
BDBM50207849
Substrate
Meas. Tech.
ChEMBL_455048 (CHEMBL887077)
IC50
9±n/a nM
Citation
 Hodous, BLGeuns-Meyer, SDHughes, PEAlbrecht, BKBellon, SCaenepeel, SCee, VJChaffee, SCEmery, MFretland, JGallant, PGu, YJohnson, REKim, JLLong, AMMorrison, MOlivieri, PRPatel, VFPolverino, ARose, PWang, LZhao, H Synthesis, structural analysis, and SAR studies of triazine derivatives as potent, selective Tie-2 inhibitors. Bioorg Med Chem Lett 17:2886-9 (2007)  
Target
Name:
Vascular endothelial growth factor receptor 2
Synonyms:
CD_antigen=CD309 Fetal liver kinase 1 (FLK-1) KDR Protein-tyrosine kinase receptor Flk-1 VEGFR-2 VEGFR2 Vascular Endothelial Growth Factor Receptor Kinase 2 Vascular endothelial growth factor receptor 2 (KDR) Vascular endothelial growth factor receptor 2 (VEGFR2) Vascular endothelial growth factor receptor-2 (VEGFR-2)
Type:
Receptor Tyrosine Kinase
Mol. Mass.:
151510.97
Organism:
Homo sapiens (Human)
Description:
P35968
Residue:
1356
  
Inhibitor
Name:
BDBM50207849
Synonyms:
CHEMBL246151 | N-(2-chloro-5-(3-(2-(methylamino)pyridin-4-yl)pyridin-2-yloxy)phenyl)-3-isopropylbenzamide
Type:
Small organic molecule
Emp. Form.:
C27H25ClN4O2
Mol. Mass.:
472.966
SMILES:
CNc1cc(ccn1)-c1cccnc1Oc1ccc(Cl)c(NC(=O)c2cccc(c2)C(C)C)c1
: