Target
Angiopoietin-1 receptor
Ligand
BDBM50207852
Substrate
Meas. Tech.
ChEMBL_455049 (CHEMBL887078)
IC50
5±n/a nM
Citation
 Hodous, BLGeuns-Meyer, SDHughes, PEAlbrecht, BKBellon, SCaenepeel, SCee, VJChaffee, SCEmery, MFretland, JGallant, PGu, YJohnson, REKim, JLLong, AMMorrison, MOlivieri, PRPatel, VFPolverino, ARose, PWang, LZhao, H Synthesis, structural analysis, and SAR studies of triazine derivatives as potent, selective Tie-2 inhibitors. Bioorg Med Chem Lett 17:2886-9 (2007)  
Target
Name:
Angiopoietin-1 receptor
Synonyms:
TEK TIE2_HUMAN Tyrosine-protein kinase receptor (TIE-2) Tyrosine-protein kinase receptor TEK (p140 TEK) Tyrosine-protein kinase receptor TIE2/TEK VMCM1 p140 TEK
Type:
Enzyme
Mol. Mass.:
125835.70
Organism:
Homo sapiens (Human)
Description:
Q02763
Residue:
1124
  
Inhibitor
Name:
BDBM50207852
Synonyms:
3-isopropyl-N-(4-methyl-3-(3-(4-(methylamino)-1,3,5-triazin-2-yl)pyridin-2-yloxy)phenyl)benzamide | CHEMBL245746
Type:
Small organic molecule
Emp. Form.:
C26H26N6O2
Mol. Mass.:
454.5236
SMILES:
CNc1ncnc(n1)-c1cccnc1Oc1cc(NC(=O)c2cccc(c2)C(C)C)ccc1C
: