Target
Muscarinic acetylcholine receptor M3
Ligand
BDBM50208044
Substrate
Meas. Tech.
ChEMBL_429188 (CHEMBL913822)
Ki
1.04±n/a nM
Citation
 Peretto, IFossati, CGiardina, GAGiardini, AGuala, MLa Porta, EPetrillo, PRadaelli, SRadice, LRaveglia, LFSantoro, EScudellaro, RScarpitta, FCerri, AMenegon, SDondio, GMRizzi, AArmani, EAmari, GCivelli, MVilletti, GPatacchini, RBergamaschi, MBassani, FDelcanale, MImbimbo, BP Discovery of diaryl imidazolidin-2-one derivatives, a novel class of muscarinic M3 selective antagonists (Part 2). J Med Chem 50:1693-7 (2007)  
Target
Name:
Muscarinic acetylcholine receptor M3
Synonyms:
ACM3_HUMAN Cholinergic, muscarinic M3 Muscarinic receptor M3 | RecName: Full=Muscarinic acetylcholine receptor M3
Type:
Enzyme
Mol. Mass.:
66151.03
Organism:
Homo sapiens (Human)
Description:
P20309
Residue:
590
  
Inhibitor
Name:
BDBM50208044
Synonyms:
1-methyl-3-(R)-(2-oxo-4,4-diphenyl-imidazolidin-1-yl)-1-(2-phenoxy-ethyl)-pyrrolidinium | CHEMBL387546
Type:
Small organic molecule
Emp. Form.:
C28H32N3O2
Mol. Mass.:
442.572
SMILES:
C[N+]1(CCOc2ccccc2)CC[C@H](C1)N1CC(NC1=O)(c1ccccc1)c1ccccc1
: