Target
Cathepsin G
Ligand
BDBM50208224
Substrate
Meas. Tech.
ChEMBL_429293 (CHEMBL915854)
Ki
38±n/a nM
Citation
 Greco, MNHawkins, MJPowell, ETAlmond, HRde Garavilla, LHall, JMinor, LKWang, YCorcoran, TWDi Cera, ECantwell, AMSavvides, SNDamiano, BPMaryanoff, BE Discovery of potent, selective, orally active, nonpeptide inhibitors of human mast cell chymase. J Med Chem 50:1727-30 (2007)  
Target
Name:
Cathepsin G
Synonyms:
CATG_HUMAN CTSG
Type:
PROTEIN
Mol. Mass.:
28860.08
Organism:
Homo sapiens (Human)
Description:
ChEMBL_1469016
Residue:
255
  
Inhibitor
Name:
BDBM50208224
Synonyms:
2-(3-((1-(2-naphthoyl)piperidin-4-yl)(methyl)carbamoyl)naphthalen-2-yl)-1-(naphthalen-1-yl)-2-oxoethylphosphonic acid | CHEMBL374027
Type:
Small organic molecule
Emp. Form.:
C40H35N2O6P
Mol. Mass.:
670.6895
SMILES:
CN(C1CCN(CC1)C(=O)c1ccc2ccccc2c1)C(=O)c1cc2ccccc2cc1C(=O)C(c1cccc2ccccc12)P(O)(O)=O
: