Target
Sodium-dependent serotonin transporter
Ligand
BDBM30130
Substrate
Meas. Tech.
ChEMBL_443351 (CHEMBL893599)
Ki
8.7±n/a nM
Citation
 Lee, JHChoi, YHLim, YJLee, BSChi, DYJin, C Syntheses and binding affinities of 6-nitroquipazine analogues for serotonin transporter. Part 5: 2'-Substituted 6-nitroquipazines. Bioorg Med Chem 15:3499-504 (2007)  
Target
Name:
Sodium-dependent serotonin transporter
Synonyms:
5-HT Transporter 5HT transporter Anandamid membrane transporter, AMT Monoamine transporters; Norepinephrine & serotonin Slc6a4 Sodium-dependent serotonin transporter (SERT) | imipramine receptor
Type:
Multi-pass membrane protein
Mol. Mass.:
70168.43
Organism:
Rattus norvegicus (rat)
Description:
P31652
Residue:
630
  
Inhibitor
Name:
BDBM30130
Synonyms:
CHEMBL1201082 Fluoxetin Prozac cid_62857
Type:
Small organic molecule
Emp. Form.:
C17H18F3NO
Mol. Mass.:
309.3261
SMILES:
CNCCC(Oc1ccc(cc1)C(F)(F)F)c1ccccc1
: