Target
Sodium-dependent serotonin transporter
Ligand
BDBM50209172
Substrate
Meas. Tech.
ChEMBL_443463 (CHEMBL893721)
IC50
0.56±n/a nM
Citation
 Deskus, JAEpperson, JRSloan, CPCipollina, JADextraze, PQian-Cutrone, JGao, QMa, BBeno, BRMattson, GKMolski, TFKrause, RGTaber, MTLodge, NJMattson, RJ Conformationally restricted homotryptamines 3. Indole tetrahydropyridines and cyclohexenylamines as selective serotonin reuptake inhibitors. Bioorg Med Chem Lett 17:3099-104 (2007)  
Target
Name:
Sodium-dependent serotonin transporter
Synonyms:
5-HT Transporter 5HTT SC6A4_HUMAN SLC6A4 Serotonin transporter (5HTT) Sodium-dependent serotonin transporter (SERT) | Solute carrier family 6 member 4
Type:
Multi-pass membrane protein
Mol. Mass.:
70322.51
Organism:
Homo sapiens (Human)
Description:
P31645
Residue:
630
  
Inhibitor
Name:
BDBM50209172
Synonyms:
(S)-3-(4-(dimethylamino)cyclohex-1-enyl)-1H-indole-5-carbonitrile | CHEMBL234705
Type:
Small organic molecule
Emp. Form.:
C17H19N3
Mol. Mass.:
265.3529
SMILES:
CN(C)[C@H]1CCC(=CC1)c1c[nH]c2ccc(cc12)C#N
: