Target
Baculoviral IAP repeat-containing protein 5
Ligand
BDBM50209184
Substrate
Meas. Tech.
ChEMBL_443470 (CHEMBL893728)
Kd
7560±n/a nM
Citation
 Wendt, MDSun, CKunzer, ASauer, DSarris, KHoff, EYu, LNettesheim, DGChen, JJin, SComess, KMFan, YAnderson, SNIsaac, BOlejniczak, ETHajduk, PJRosenberg, SHElmore, SW Discovery of a novel small molecule binding site of human survivin. Bioorg Med Chem Lett 17:3122-9 (2007)  
Target
Name:
Baculoviral IAP repeat-containing protein 5
Synonyms:
API4 Apoptosis inhibitor survivin BIRC5_HUMAN | IAP4
Type:
PROTEIN
Mol. Mass.:
16386.52
Organism:
Homo sapiens (Human)
Description:
ChEMBL_443470
Residue:
142
  
Inhibitor
Name:
BDBM50209184
Synonyms:
4-(2,5-dichlorophenyl)-6-(2-hydroxy-5-isobutylphenyl)-2-oxo-1,2-dihydropyridine-3-carbonitrile | CHEMBL399196
Type:
Small organic molecule
Emp. Form.:
C22H18Cl2N2O2
Mol. Mass.:
413.297
SMILES:
CC(C)Cc1ccc(O)c(c1)-c1cc(-c2cc(Cl)ccc2Cl)c(C#N)c(=O)[nH]1
: