Target
Baculoviral IAP repeat-containing protein 5
Ligand
BDBM50209201
Substrate
Meas. Tech.
ChEMBL_443470 (CHEMBL893728)
Kd
48±n/a nM
Citation
 Wendt, MDSun, CKunzer, ASauer, DSarris, KHoff, EYu, LNettesheim, DGChen, JJin, SComess, KMFan, YAnderson, SNIsaac, BOlejniczak, ETHajduk, PJRosenberg, SHElmore, SW Discovery of a novel small molecule binding site of human survivin. Bioorg Med Chem Lett 17:3122-9 (2007)  
Target
Name:
Baculoviral IAP repeat-containing protein 5
Synonyms:
API4 Apoptosis inhibitor survivin BIRC5_HUMAN | IAP4
Type:
PROTEIN
Mol. Mass.:
16386.52
Organism:
Homo sapiens (Human)
Description:
ChEMBL_443470
Residue:
142
  
Inhibitor
Name:
BDBM50209201
Synonyms:
CHEMBL233848 | N-(5-chloro-3-(4-(2-chloro-5-(trifluoromethyl)phenyl)-5-cyano-6-oxo-1,6-dihydropyridin-2-yl)-2-hydroxybenzyl)-1-acetylpiperidine-4-carboxamide
Type:
Small organic molecule
Emp. Form.:
C28H23Cl2F3N4O4
Mol. Mass.:
607.408
SMILES:
CC(=O)N1CCC(CC1)C(=O)NCc1cc(Cl)cc(c1O)-c1cc(-c2cc(ccc2Cl)C(F)(F)F)c(C#N)c(=O)[nH]1
: