Target
Plasmepsin II
Ligand
BDBM50209559
Substrate
Meas. Tech.
ChEMBL_438604 (CHEMBL887761)
Ki
0.5±n/a nM
Citation
 Hidaka, KKimura, TTsuchiya, YKamiya, MRuben, AJFreire, EHayashi, YKiso, Y Additional interaction of allophenylnorstatine-containing tripeptidomimetics with malarial aspartic protease plasmepsin II. Bioorg Med Chem Lett 17:3048-52 (2007)  
Target
Name:
Plasmepsin II
Synonyms:
Aspartic hemoglobinase II PLM2_PLAFX Plasmepsin 2 Plasmepsin-II
Type:
Enzyme
Mol. Mass.:
51482.09
Organism:
Plasmodium falciparum
Description:
P46925
Residue:
453
  
Inhibitor
Name:
BDBM50209559
Synonyms:
(4R)-3-[(2S,3S)-3-{[(2,6-dimethylphenoxy)acetyl]amino}-2-hydroxy-4-phenylbutanoyl]-N-[(1S,2R)-2-hydroxy-2,3-dihydro-1H-inden-1-yl]-5,5-dimethyl-1,3-thiazolidine-4-carboxamide CHEMBL231522 | KNI-10006
Type:
Small organic molecule
Emp. Form.:
C35H41N3O6S
Mol. Mass.:
631.782
SMILES:
Cc1cccc(C)c1OCC(=O)N[C@@H](Cc1ccccc1)[C@H](O)C(=O)N1CSC(C)(C)[C@H]1C(=O)N[C@@H]1[C@H](O)Cc2ccccc12
: