Target
Sodium-dependent serotonin transporter
Ligand
BDBM50209681
Substrate
Meas. Tech.
ChEMBL_443656 (CHEMBL893915)
Ki
9.2±n/a nM
Citation
 Zhou, DHatzenbuhler, NTGross, JLHarrison, BLEvrard, DAChlenov, MGolembieski, JHornby, GSchechter, LESmith, DLAndree, THStack, GP Novel pyridyl-fused 3-amino chroman derivatives with dual action at serotonin transporter and 5-HT1A receptor. Bioorg Med Chem Lett 17:3117-21 (2007)  
Target
Name:
Sodium-dependent serotonin transporter
Synonyms:
5-HT Transporter 5HT transporter Anandamid membrane transporter, AMT Monoamine transporters; Norepinephrine & serotonin Slc6a4 Sodium-dependent serotonin transporter (SERT) | imipramine receptor
Type:
Multi-pass membrane protein
Mol. Mass.:
70168.43
Organism:
Rattus norvegicus (rat)
Description:
P31652
Residue:
630
  
Inhibitor
Name:
BDBM50209681
Synonyms:
CHEMBL395586 | N-(3-(5-fluoro-1H-indol-3-yl)propyl)-5-methoxy-3,4-dihydro-2H-chromen-3-amine
Type:
Small organic molecule
Emp. Form.:
C21H23FN2O2
Mol. Mass.:
354.4179
SMILES:
COc1cccc2OCC(Cc12)NCCCc1c[nH]c2ccc(F)cc12
: