Target
Sodium-dependent serotonin transporter
Ligand
BDBM50209808
Substrate
Meas. Tech.
ChEMBL_455313 (CHEMBL886089)
Ki
10±n/a nM
Citation
 Stocking, EMMiller, JMBarbier, AJWilson, SJBoggs, JDMcAllister, HMWu, JLovenberg, TWCarruthers, NIWolin, RL Synthesis and biological evaluation of diamine-based histamine H3 antagonists with serotonin reuptake inhibitor activity. Bioorg Med Chem Lett 17:3130-5 (2007)  
Target
Name:
Sodium-dependent serotonin transporter
Synonyms:
5-HT Transporter 5HT transporter Anandamid membrane transporter, AMT Monoamine transporters; Norepinephrine & serotonin Slc6a4 Sodium-dependent serotonin transporter (SERT) | imipramine receptor
Type:
Multi-pass membrane protein
Mol. Mass.:
70168.43
Organism:
Rattus norvegicus (rat)
Description:
P31652
Residue:
630
  
Inhibitor
Name:
BDBM50209808
Synonyms:
CHEMBL248375 | N,N-dimethyl-3-(4-(3-(piperidin-1-yl)propoxy)phenyl)-3-(4-(trifluoromethyl)phenoxy)propan-1-amine
Type:
Small organic molecule
Emp. Form.:
C26H35F3N2O2
Mol. Mass.:
464.5635
SMILES:
CN(C)CCC(Oc1ccc(cc1)C(F)(F)F)c1ccc(OCCCN2CCCCC2)cc1
: