Target
C-C chemokine receptor type 3
Ligand
BDBM50210022
Substrate
Meas. Tech.
ChEMBL_458974 (CHEMBL925069)
IC50
1.7±n/a nM
Citation
 Pruitt, JRBatt, DGWacker, DABostrom, LLBooker, SKMcLaughlin, EHoughton, GCVarnes, JGChrist, DDCovington, MDas, AMDavies, PGraden, DKariv, IOrlovsky, YStowell, NCVaddi, KGWadman, EAWelch, PKYeleswaram, SSolomon, KANewton, RCDecicco, CPCarter, PHKo, SS CC chemokine receptor-3 (CCR3) antagonists: improving the selectivity of DPC168 by reducing central ring lipophilicity. Bioorg Med Chem Lett 17:2992-7 (2007)  
Target
Name:
C-C chemokine receptor type 3
Synonyms:
C-C CKR-3 CC-CKR-3 CCR3 CD_antigen=CD193 CMKBR3 | Eosinophil eotaxin receptor
Type:
Enzyme
Mol. Mass.:
41053.88
Organism:
Homo sapiens (Human)
Description:
P51677
Residue:
355
  
Inhibitor
Name:
BDBM50210022
Synonyms:
1-((2S,3R)-2-(((S)-3-(4-fluorobenzyl)piperidin-1-yl)methyl)-tetrahydro-2H-pyran-3-yl)-3-(5-acetyl-4-methylthiazol-2-yl)urea | CHEMBL404213
Type:
Small organic molecule
Emp. Form.:
C25H33FN4O3S
Mol. Mass.:
488.618
SMILES:
CC(=O)c1sc(NC(=O)N[C@@H]2CCCO[C@H]2CN2CCC[C@@H](Cc3ccc(F)cc3)C2)nc1C
: