Target
C-C chemokine receptor type 3
Ligand
BDBM50210002
Substrate
Meas. Tech.
ChEMBL_458974 (CHEMBL925069)
IC50
0.900000±n/a nM
Citation
 Pruitt, JRBatt, DGWacker, DABostrom, LLBooker, SKMcLaughlin, EHoughton, GCVarnes, JGChrist, DDCovington, MDas, AMDavies, PGraden, DKariv, IOrlovsky, YStowell, NCVaddi, KGWadman, EAWelch, PKYeleswaram, SSolomon, KANewton, RCDecicco, CPCarter, PHKo, SS CC chemokine receptor-3 (CCR3) antagonists: improving the selectivity of DPC168 by reducing central ring lipophilicity. Bioorg Med Chem Lett 17:2992-7 (2007)  
Target
Name:
C-C chemokine receptor type 3
Synonyms:
C-C CKR-3 CC-CKR-3 CCR3 CD_antigen=CD193 CMKBR3 | Eosinophil eotaxin receptor
Type:
Enzyme
Mol. Mass.:
41053.88
Organism:
Homo sapiens (Human)
Description:
P51677
Residue:
355
  
Inhibitor
Name:
BDBM50210002
Synonyms:
1-((3R,4R)-3-(((S)-3-(4-fluorobenzyl)piperidin-1-yl)methyl)-1-(furan-2-ylmethyl)piperidin-4-yl)-3-(5-acetyl-4-methylthiazol-2-yl)urea | CHEMBL428761
Type:
Small organic molecule
Emp. Form.:
C30H38FN5O3S
Mol. Mass.:
567.718
SMILES:
CC(=O)c1sc(NC(=O)N[C@@H]2CCN(Cc3ccco3)C[C@H]2CN2CCC[C@@H](Cc3ccc(F)cc3)C2)nc1C
: