Target
5-hydroxytryptamine receptor 2A
Ligand
BDBM50210083
Substrate
Meas. Tech.
ChEMBL_443937 (CHEMBL893103)
EC50
6.2±n/a nM
Citation
 Feng, ZMohapatra, SKlimko, PGHellberg, MRMay, JAKelly, CWilliams, GMcLaughlin, MASharif, NA Novel benzodifuran analogs as potent 5-HT2A receptor agonists with ocular hypotensive activity. Bioorg Med Chem Lett 17:2998-3002 (2007)  
Target
Name:
5-hydroxytryptamine receptor 2A
Synonyms:
5-HT-2A 5-HT2A 5-hydroxytryptamine receptor 2A (5HT2A) Htr2 Serotonin Receptor 2A
Type:
G Protein-Coupled Receptor (GPCR)
Mol. Mass.:
52852.05
Organism:
Rattus norvegicus (rat)
Description:
Rat cortex membranes 5-HT2A receptors.
Residue:
471
  
Inhibitor
Name:
BDBM50210083
Synonyms:
CHEMBL232995 | [8-((R)-2-amino-propyl)-2,3,6,7-tetrahydro-benzo[1,2-b;4,5-b']difuran-4-ylmethoxy]-acetic acid phenyl ester
Type:
Small organic molecule
Emp. Form.:
C22H25NO5
Mol. Mass.:
383.4376
SMILES:
C[C@@H](N)Cc1c2CCOc2c(COCC(=O)Oc2ccccc2)c2CCOc12
: