Target
Glutamate receptor 2
Ligand
BDBM50166286
Substrate
Meas. Tech.
ChEMBL_435003 (CHEMBL920804)
Ki
0.08±n/a nM
Citation
 Vogensen, SBFrydenvang, KGreenwood, JRPostorino, GNielsen, BPickering, DSEbert, BBølcho, UEgebjerg, JGajhede, MKastrup, JSJohansen, TNClausen, RPKrogsgaard-Larsen, P A tetrazolyl-substituted subtype-selective AMPA receptor agonist. J Med Chem 50:2408-14 (2007)  
Target
Name:
Glutamate receptor 2
Synonyms:
GRIA2_RAT Glutamate receptor AMPA 2/4 Gria2
Type:
PROTEIN
Mol. Mass.:
98691.74
Organism:
Rattus norvegicus
Description:
ChEMBL_936441
Residue:
883
  
Inhibitor
Name:
BDBM50166286
Synonyms:
(RS)-2-amino-3-[3-hydroxy-5-(2-ethyl-2H-5-tetrazolyl)-4-isoxazolyl]propionic acid 2-amino-3-(5-(2-ethyl-2H-tetrazol-5-yl)-3-hydroxyisoxazol-4-yl)propanoic acid | CHEMBL370941
Type:
Small organic molecule
Emp. Form.:
C9H12N6O4
Mol. Mass.:
268.2294
SMILES:
CCn1nnc(n1)-c1o[nH]c(=O)c1CC(N)C(O)=O
: