Target
Glutamate receptor 3
Ligand
BDBM50211399
Substrate
Meas. Tech.
ChEMBL_435004 (CHEMBL920255)
Ki
0.39±n/a nM
Citation
 Vogensen, SBFrydenvang, KGreenwood, JRPostorino, GNielsen, BPickering, DSEbert, BBølcho, UEgebjerg, JGajhede, MKastrup, JSJohansen, TNClausen, RPKrogsgaard-Larsen, P A tetrazolyl-substituted subtype-selective AMPA receptor agonist. J Med Chem 50:2408-14 (2007)  
Target
Name:
Glutamate receptor 3
Synonyms:
GRIA3_RAT Glutamate receptor 3 Glutamate-AMPA | Gria3
Type:
Enzyme Catalytic Domain
Mol. Mass.:
100383.57
Organism:
RAT
Description:
Glutamate-AMPA GRIA3 RAT::P19492
Residue:
888
  
Inhibitor
Name:
BDBM50211399
Synonyms:
(RS)-2-amino-3-[3-hydroxy-5-(2-benzyl-2H-5-tetrazolyl)-4-isoxazolyl]propionic acid CHEMBL388746
Type:
Small organic molecule
Emp. Form.:
C14H14N6O4
Mol. Mass.:
330.2988
SMILES:
NC(Cc1c(o[nH]c1=O)-c1nnn(Cc2ccccc2)n1)C(O)=O
: