Target
Transcription factor Jun
Ligand
BDBM50211429
Substrate
Meas. Tech.
ChEMBL_455594 (CHEMBL886374)
IC50
2770±n/a nM
Citation
 Alam, MBeevers, RECeska, TDavenport, RJDickson, KMFortunato, MGowers, LHaughan, AFJames, LAJones, MWKinsella, NLowe, CMeissner, JWNicolas, ALPerry, BGPhillips, DJPitt, WRPlatt, ARatcliffe, AJSharpe, ATait, LJ Synthesis and SAR of aminopyrimidines as novel c-Jun N-terminal kinase (JNK) inhibitors. Bioorg Med Chem Lett 17:3463-7 (2007)  
Target
Name:
Transcription factor Jun
Synonyms:
AP1 JUN Proto-oncogene c-JUN Transcription factor AP1 p39
Type:
Mol. Mass.:
35683.24
Organism:
Homo sapiens (Human)
Description:
P05412
Residue:
331
  
Inhibitor
Name:
BDBM50211429
Synonyms:
(4-(5-chloro-4-(1H-indol-3-yl)pyrimidin-2-ylamino)piperidin-1-yl)(4-methylpiperazin-1-yl)methanone | CHEMBL245534
Type:
Small organic molecule
Emp. Form.:
C23H28ClN7O
Mol. Mass.:
453.968
SMILES:
CN1CCN(CC1)C(=O)N1CCC(CC1)Nc1ncc(Cl)c(n1)-c1c[nH]c2ccccc12
: