Target
Cyclin-dependent kinase 2
Ligand
BDBM50211441
Substrate
Meas. Tech.
ChEMBL_455593 (CHEMBL886373)
IC50
10000±n/a nM
Citation
 Alam, MBeevers, RECeska, TDavenport, RJDickson, KMFortunato, MGowers, LHaughan, AFJames, LAJones, MWKinsella, NLowe, CMeissner, JWNicolas, ALPerry, BGPhillips, DJPitt, WRPlatt, ARatcliffe, AJSharpe, ATait, LJ Synthesis and SAR of aminopyrimidines as novel c-Jun N-terminal kinase (JNK) inhibitors. Bioorg Med Chem Lett 17:3463-7 (2007)  
Target
Name:
Cyclin-dependent kinase 2
Synonyms:
CDK2 CDK2_HUMAN Cell division protein kinase 2 Protein cereblon/Cyclin-dependent kinase 2 | p33 protein kinase
Type:
Enzyme Subunit
Mol. Mass.:
33938.17
Organism:
Homo sapiens (Human)
Description:
P24941
Residue:
298
  
Inhibitor
Name:
BDBM50211441
Synonyms:
4-(4-(1H-indol-3-yl)pyrimidin-2-ylamino)-N-ethylpiperidine-1-carboxamide | CHEMBL245725
Type:
Small organic molecule
Emp. Form.:
C20H24N6O
Mol. Mass.:
364.4442
SMILES:
CCNC(=O)N1CCC(CC1)Nc1nccc(n1)-c1c[nH]c2ccccc12
: