Target
Transcription factor Jun
Ligand
BDBM50211447
Substrate
Meas. Tech.
ChEMBL_455594 (CHEMBL886374)
IC50
14667±n/a nM
Citation
 Alam, MBeevers, RECeska, TDavenport, RJDickson, KMFortunato, MGowers, LHaughan, AFJames, LAJones, MWKinsella, NLowe, CMeissner, JWNicolas, ALPerry, BGPhillips, DJPitt, WRPlatt, ARatcliffe, AJSharpe, ATait, LJ Synthesis and SAR of aminopyrimidines as novel c-Jun N-terminal kinase (JNK) inhibitors. Bioorg Med Chem Lett 17:3463-7 (2007)  
Target
Name:
Transcription factor Jun
Synonyms:
AP1 JUN Proto-oncogene c-JUN Transcription factor AP1 p39
Type:
Mol. Mass.:
35683.24
Organism:
Homo sapiens (Human)
Description:
P05412
Residue:
331
  
Inhibitor
Name:
BDBM50211447
Synonyms:
2-((S)-3-(5-chloro-4-(1H-indol-3-yl)pyrimidin-2-ylamino)piperidin-1-yl)-N-methylacetamide | CHEMBL245334
Type:
Small organic molecule
Emp. Form.:
C20H23ClN6O
Mol. Mass.:
398.889
SMILES:
CNC(=O)CN1CCC[C@@H](C1)Nc1ncc(Cl)c(n1)-c1c[nH]c2ccccc12
: