Target
Mitogen-activated protein kinase 8
Ligand
BDBM50211426
Substrate
Meas. Tech.
ChEMBL_455590 (CHEMBL886370)
IC50
15±n/a nM
Citation
 Alam, MBeevers, RECeska, TDavenport, RJDickson, KMFortunato, MGowers, LHaughan, AFJames, LAJones, MWKinsella, NLowe, CMeissner, JWNicolas, ALPerry, BGPhillips, DJPitt, WRPlatt, ARatcliffe, AJSharpe, ATait, LJ Synthesis and SAR of aminopyrimidines as novel c-Jun N-terminal kinase (JNK) inhibitors. Bioorg Med Chem Lett 17:3463-7 (2007)  
Target
Name:
Mitogen-activated protein kinase 8
Synonyms:
JNK-46 JNK1-alpha-1 MK08_HUMAN PRKM8 SAPK1C c-Jun N-terminal kinase 1 c-Jun N-terminal kinase 1(JNK1) | c-Jun N-terminal kinase 2 (JNK2)
Type:
Enzyme
Mol. Mass.:
48297.57
Organism:
Homo sapiens (Human)
Description:
JNK-1 was purchased from Upstate Cell Signaling Solutions (formerly Upstate Biotechnology).
Residue:
427
  
Inhibitor
Name:
BDBM50211426
Synonyms:
2-((R)-3-(5-chloro-4-(1H-indol-3-yl)pyrimidin-2-ylamino)piperidin-1-yl)-N-methylacetamide | CHEMBL392615
Type:
Small organic molecule
Emp. Form.:
C20H23ClN6O
Mol. Mass.:
398.889
SMILES:
CNC(=O)CN1CCC[C@H](C1)Nc1ncc(Cl)c(n1)-c1c[nH]c2ccccc12
: