Target
Glutamate receptor ionotropic, NMDA 2B
Ligand
BDBM50212682
Substrate
Meas. Tech.
ChEMBL_455780 (CHEMBL887786)
Ki
75±n/a nM
Citation
 Nguyen, KTClaiborne, CFMcCauley, JALibby, BEClaremon, DABednar, RAMosser, SDGaul, SLConnolly, TMCondra, CLBednar, BStump, GLLynch, JJKoblan, KSLiverton, NJ Cyclic benzamidines as orally efficacious NR2B-selective NMDA receptor antagonists. Bioorg Med Chem Lett 17:3997-4000 (2007)  
Target
Name:
Glutamate receptor ionotropic, NMDA 2B
Synonyms:
GRIN2B Glutamate [NMDA] receptor subunit epsilon 2 N-methyl D-aspartate receptor subtype 2B NMDAR2B NR3 | hNR3
Type:
PROTEIN
Mol. Mass.:
166375.46
Organism:
Homo sapiens (Human)
Description:
ChEMBL_1438829
Residue:
1484
  
Inhibitor
Name:
BDBM50212682
Synonyms:
2-(3-chloro-4-(trifluoromethoxy)phenyl)-5-(2-methoxyphenyl)-4,5-dihydro-1H-imidazole | CHEMBL397784
Type:
Small organic molecule
Emp. Form.:
C17H14ClF3N2O2
Mol. Mass.:
370.753
SMILES:
COc1ccccc1C1CNC(=N1)c1ccc(OC(F)(F)F)c(Cl)c1
: